Reaction Details
TargetSerine/threonine-protein kinase mTOR
LigandBDBM50343775
Substrate/Competitorn/a
Meas. Tech.ChEMBL_747582 (CHEMBL1777163)
IC50 2.6±n/a nM
Citation Cohen, FBergeron, PBlackwood, EBowman, KKChen, HDipasquale, AGEpler, JAKoehler, MFLau, KLewis, CLiu, LLy, CQMalek, SNonomiya, JOrtwine, DFPei, ZRobarge, KDSideris, STrinh, LTruong, TWu, JZhao, XLyssikatos, JP Potent, selective, and orally bioavailable inhibitors of mammalian target of rapamycin (mTOR) kinase based on a quaternary substituted dihydrofuropyrimidine. J Med Chem54:3426-35 (2011) 
 
Serine/threonine-protein kinase mTOR
Name:Serine/threonine-protein kinase mTOR
Type:Rapamycin target protein
Mol. Mass.:288917.12
Organism:Homo sapiens (Human)
Description:P42345
Residue:2549
BDBM50343775
NameBDBM50343775
Synonyms:(S)-1-ethyl-3-(4-(7-(2-hydroxyethyl)-7-methyl-4-morpholino-5,7-dihydrofuro[3,4-d]pyrimidin-2-yl)phenyl)urea | CHEMBL1774364
TypeSmall organic molecule
Emp. Form.C22H29N5O4
Mol. Mass.427.4968
SMILESCCNC(=O)Nc1ccc(cc1)-c1nc2c(CO[C@@]2(C)CCO)c(n1)N1CCOCC1