Reaction Details
TargetPeptidyl-prolyl cis-trans isomerase NIMA-interacting 1
LigandBDBM50343862
Substrate/Competitorn/a
Meas. Tech.ChEMBL_747359 (CHEMBL1776704)
IC50 4870±n/a nM
Citation Zhu, LJin, JLiu, CZhang, CSun, YGuo, YFu, DChen, XXu, B Synthesis and biological evaluation of novel quinazoline-derived human Pin1 inhibitors. Bioorg Med Chem19:2797-807 (2011) 
 
Peptidyl-prolyl cis-trans isomerase NIMA-interacting 1
Name:Peptidyl-prolyl cis-trans isomerase NIMA-interacting 1
Type:PROTEIN
Mol. Mass.:18248.11
Organism:Homo sapiens (Human)
Description:ChEMBL_1502595
Residue:163
BDBM50343862
NameBDBM50343862
Synonyms:4-(6-Nitro-2-(4-phenoxyphenylamino)quinazolin-4-ylamino)benzoic acid | CHEMBL1774777
TypeSmall organic molecule
Emp. Form.C27H19N5O5
Mol. Mass.493.4703
SMILESOC(=O)c1ccc(Nc2nc(Nc3ccc(Oc4ccccc4)cc3)nc3ccc(cc23)[N+]([O-])=O)cc1