Reaction Details
TargetP2Y purinoceptor 14
LigandBDBM50343877
Substrate/Competitorn/a
Meas. Tech.ChEMBL_747401 (CHEMBL1776795)
IC50 14±n/a nM
Citation Gauthier, JYBelley, MDeschênes, DFournier, JFGagné, SGareau, YHamel, MHénault, MHyjazie, HKargman, SLavallée, GLevesque, JFLi, LMamane, YMancini, JMorin, NMulrooney, ERobichaud, JThérien, MTranmer, GWang, ZWu, JBlack, WC The identification of 4,7-disubstituted naphthoic acid derivatives as UDP-competitive antagonists of P2Y14. Bioorg Med Chem Lett21:2836-9 (2011) 
 
P2Y purinoceptor 14
Name:P2Y purinoceptor 14
Type:PROTEIN
Mol. Mass.:38883.93
Organism:Mus musculus
Description:ChEMBL_745158
Residue:338
BDBM50343877
NameBDBM50343877
Synonyms:7-(4-fluoro-2,6-dimethylbenzyloxy)-4-(thiophen-3-yl)-2-naphthoic acid | CHEMBL1774892
TypeSmall organic molecule
Emp. Form.C24H19FO3S
Mol. Mass.406.469
SMILESCc1cc(F)cc(C)c1COc1ccc2c(cc(cc2c1)C(O)=O)-c1ccsc1