Reaction Details
TargetDisintegrin and metalloproteinase domain-containing protein 17
LigandBDBM50343959
Substrate/Competitorn/a
Meas. Tech.ChEMBL_748329 (CHEMBL1781453)
Ki 4±n/a nM
Citation Li, DPopovici-Muller, JBelanger, DBCaldwell, JDai, CDavid, MGirijavallabhan, VMLavey, BJLee, JFLiu, ZMazzola, RRizvi, RRosner, KEShankar, BSpitler, JTing, PCVaccaro, HYu, WZhou, GZhu, ZNiu, XSun, JGuo, ZOrth, PChen, SKozlowski, JALundell, DJMadison, VMcKittrick, BPiwinski, JJShih, NYShipps, GWSiddiqui, MAStrickland, CO Structure and activity relationships of tartrate-based TACE inhibitors. Bioorg Med Chem Lett20:4812-5 (2010) 
 
Disintegrin and metalloproteinase domain-containing protein 17
Name:Disintegrin and metalloproteinase domain-containing protein 17
Type:Enzyme
Mol. Mass.:93007.89
Organism:Homo sapiens (Human)
Description:
Residue:824
BDBM50343959
NameBDBM50343959
Synonyms:CHEMBL1779630 | rac-(2R,3R)-N-(4-(1H-pyrazol-1-yl)benzyl)-4-(2-(3-chlorophenyl)pyrrolidin-1-yl)-2,3-dihydroxy-4-oxobutanamide
TypeSmall organic molecule
Emp. Form.C24H25ClN4O4
Mol. Mass.468.933
SMILESO[C@H]([C@@H](O)C(=O)N1CCCC1c1cccc(Cl)c1)C(=O)NCc1ccc(cc1)-n1cccn1