Reaction Details
TargetDisintegrin and metalloproteinase domain-containing protein 17
LigandBDBM50343979
Substrate/Competitorn/a
Meas. Tech.ChEMBL_748329 (CHEMBL1781453)
Ki 17±n/a nM
Citation Li, DPopovici-Muller, JBelanger, DBCaldwell, JDai, CDavid, MGirijavallabhan, VMLavey, BJLee, JFLiu, ZMazzola, RRizvi, RRosner, KEShankar, BSpitler, JTing, PCVaccaro, HYu, WZhou, GZhu, ZNiu, XSun, JGuo, ZOrth, PChen, SKozlowski, JALundell, DJMadison, VMcKittrick, BPiwinski, JJShih, NYShipps, GWSiddiqui, MAStrickland, CO Structure and activity relationships of tartrate-based TACE inhibitors. Bioorg Med Chem Lett20:4812-5 (2010) 
 
Disintegrin and metalloproteinase domain-containing protein 17
Name:Disintegrin and metalloproteinase domain-containing protein 17
Type:Enzyme
Mol. Mass.:93007.89
Organism:Homo sapiens (Human)
Description:
Residue:824
BDBM50343979
NameBDBM50343979
Synonyms:(2R,3R)-N-((2'-cyanobiphenyl-4-yl)methyl)-2,3-dihydroxy-4-oxo-4-((R)-2-phenylpyrrolidin-1-yl)butanamide | CHEMBL1779612
TypeSmall organic molecule
Emp. Form.C28H27N3O4
Mol. Mass.469.5317
SMILESO[C@H]([C@@H](O)C(=O)N1CCC[C@@H]1c1ccccc1)C(=O)NCc1ccc(cc1)-c1ccccc1C#N