Reaction Details
TargetDisintegrin and metalloproteinase domain-containing protein 17
LigandBDBM50343984
Substrate/Competitorn/a
Meas. Tech.ChEMBL_748329 (CHEMBL1781453)
Ki 2±n/a nM
Citation Li, DPopovici-Muller, JBelanger, DBCaldwell, JDai, CDavid, MGirijavallabhan, VMLavey, BJLee, JFLiu, ZMazzola, RRizvi, RRosner, KEShankar, BSpitler, JTing, PCVaccaro, HYu, WZhou, GZhu, ZNiu, XSun, JGuo, ZOrth, PChen, SKozlowski, JALundell, DJMadison, VMcKittrick, BPiwinski, JJShih, NYShipps, GWSiddiqui, MAStrickland, CO Structure and activity relationships of tartrate-based TACE inhibitors. Bioorg Med Chem Lett20:4812-5 (2010) 
 
Disintegrin and metalloproteinase domain-containing protein 17
Name:Disintegrin and metalloproteinase domain-containing protein 17
Type:Enzyme
Mol. Mass.:93007.89
Organism:Homo sapiens (Human)
Description:
Residue:824
BDBM50343984
NameBDBM50343984
Synonyms:(2R,3R)-N-(((3S)-1-(2-cyanophenyl)-3-methylpiperidin-4-yl)methyl)-2,3-dihydroxy-4-oxo-4-((R)-2-phenylpyrrolidin-1-yl)butanamide | CHEMBL1779617
TypeSmall organic molecule
Emp. Form.C28H34N4O4
Mol. Mass.490.594
SMILESC[C@@H]1CN(CCC1CNC(=O)[C@H](O)[C@@H](O)C(=O)N1CCC[C@@H]1c1ccccc1)c1ccccc1C#N