Reaction Details
TargetB1 bradykinin receptor
LigandBDBM50344113
Substrate/Competitorn/a
Meas. Tech.ChEMBL_748611 (CHEMBL1780464)
Ki 3±n/a nM
Citation Chen, JJNguyen, TD'Amico, DCQian, WHuman, JAya, TBiswas, KFotsch, CHan, NLiu, QNishimura, NPeterkin, TAYang, KZhu, JRiahi, BBHungate, RWAndersen, NGColyer, JTFaul, MMKamassah, AWang, JJona, JKumar, GJohnson, EAskew, BC 3-Oxo-2-piperazinyl acetamides as potent bradykinin B1 receptor antagonists for the treatment of pain and inflammation. Bioorg Med Chem Lett21:3384-9 (2011) 
 
B1 bradykinin receptor
Name:B1 bradykinin receptor
Type:Enzyme
Mol. Mass.:40508.87
Organism:Homo sapiens (Human)
Description:P46663
Residue:353
BDBM50344113
NameBDBM50344113
Synonyms:CHEMBL1777971 | N-((R)-6-(morpholinomethyl)-1,2,3,4-tetrahydronaphthalen-1-yl)-2-((R)-3-oxo-1-tosylpiperazin-2-yl)acetamide
TypeSmall organic molecule
Emp. Form.C28H36N4O5S
Mol. Mass.540.674
SMILESCc1ccc(cc1)S(=O)(=O)N1CCNC(=O)[C@H]1CC(=O)N[C@@H]1CCCc2cc(CN3CCOCC3)ccc12