Reaction Details
TargetHexokinase-4
LigandBDBM50320996
Substrate/Competitorn/a
Meas. Tech.ChEMBL_748047 (CHEMBL1781588)
EC50 30±n/a nM
Citation Pike, KGAllen, JVCaulkett, PWClarke, DSDonald, CSFenwick, MLJohnson, KMJohnstone, CMcKerrecher, DRayner, JWWalker, RPWilson, I Design of a potent, soluble glucokinase activator with increased pharmacokinetic half-life. Bioorg Med Chem Lett21:3467-70 (2011) 
 
Hexokinase-4
Name:Hexokinase-4
Type:Enzyme
Mol. Mass.:52175.81
Organism:Homo sapiens (Human)
Description:P35557
Residue:465
BDBM50320996
NameBDBM50320996
Synonyms:6-(3-((S)-1-methoxypropan-2-yloxy)-5-((S)-1-phenylpropan-2-yloxy)benzamido)nicotinic acid | CHEMBL205627
TypeSmall organic molecule
Emp. Form.C26H28N2O6
Mol. Mass.464.5103
SMILESCOC[C@H](C)Oc1cc(O[C@@H](C)Cc2ccccc2)cc(c1)C(=O)Nc1ccc(cn1)C(O)=O