Reaction Details
TargetTransient receptor potential cation channel subfamily V member 1
LigandBDBM50344358
Substrate/Competitorn/a
Meas. Tech.ChEMBL_748632 (CHEMBL1780485)
IC50>1000±n/a nM
Citation Urbahns, KYura, TMogi, MTajimi, MFujishima, HMasuda, TYoshida, NMoriwaki, TLowinger, TBMeier, HChan, FMadge, DGupta, JB Naphthol derivatives as TRPV1 inhibitors for the treatment of urinary incontinence. Bioorg Med Chem Lett21:3354-7 (2011) 
 
Transient receptor potential cation channel subfamily V member 1
Name:Transient receptor potential cation channel subfamily V member 1
Type:Protein
Mol. Mass.:94960.75
Organism:Homo sapiens (Human)
Description:Q8NER1
Residue:839
BDBM50344358
NameBDBM50344358
Synonyms:1-(3-(1-hydroxyethyl)phenyl)-3-(7-hydroxynaphthalen-1-yl)urea | CHEMBL1779678
TypeSmall organic molecule
Emp. Form.C19H18N2O3
Mol. Mass.322.3578
SMILESCC(O)c1cccc(NC(=O)Nc2cccc3ccc(O)cc23)c1