Reaction Details
TargetTransient receptor potential cation channel subfamily V member 1
LigandBDBM20412
Substrate/Competitorn/a
Meas. Tech.ChEMBL_748632 (CHEMBL1780485)
IC50 3.9±n/a nM
Citation Urbahns, KYura, TMogi, MTajimi, MFujishima, HMasuda, TYoshida, NMoriwaki, TLowinger, TBMeier, HChan, FMadge, DGupta, JB Naphthol derivatives as TRPV1 inhibitors for the treatment of urinary incontinence. Bioorg Med Chem Lett21:3354-7 (2011) 
 
Transient receptor potential cation channel subfamily V member 1
Name:Transient receptor potential cation channel subfamily V member 1
Type:Protein
Mol. Mass.:94960.75
Organism:Homo sapiens (Human)
Description:Q8NER1
Residue:839
BDBM20412
NameBDBM20412
Synonyms:3-(7-hydroxynaphthalen-1-yl)-1-[3-(methylsulfanyl)phenyl]urea | naphthalene deriv., 1
TypeSmall organic molecule
Emp. Form.C18H16N2O2S
Mol. Mass.324.397
SMILESCSc1cccc(NC(=O)Nc2cccc3ccc(O)cc23)c1