Reaction Details
TargetTransient receptor potential cation channel subfamily V member 1
LigandBDBM50344364
Substrate/Competitorn/a
Meas. Tech.ChEMBL_748632 (CHEMBL1780485)
IC50 12±n/a nM
Citation Urbahns, KYura, TMogi, MTajimi, MFujishima, HMasuda, TYoshida, NMoriwaki, TLowinger, TBMeier, HChan, FMadge, DGupta, JB Naphthol derivatives as TRPV1 inhibitors for the treatment of urinary incontinence. Bioorg Med Chem Lett21:3354-7 (2011) 
 
Transient receptor potential cation channel subfamily V member 1
Name:Transient receptor potential cation channel subfamily V member 1
Type:Protein
Mol. Mass.:94960.75
Organism:Homo sapiens (Human)
Description:Q8NER1
Residue:839
BDBM50344364
NameBDBM50344364
Synonyms:1-(3,5-dichlorophenyl)-3-(7-hydroxynaphthalen-1-yl)urea | CHEMBL1779684
TypeSmall organic molecule
Emp. Form.C17H12Cl2N2O2
Mol. Mass.347.195
SMILESOc1ccc2cccc(NC(=O)Nc3cc(Cl)cc(Cl)c3)c2c1