Reaction Details
TargetTransient receptor potential cation channel subfamily V member 1
LigandBDBM50344374
Substrate/Competitorn/a
Meas. Tech.ChEMBL_748632 (CHEMBL1780485)
IC50 260±n/a nM
Citation Urbahns, KYura, TMogi, MTajimi, MFujishima, HMasuda, TYoshida, NMoriwaki, TLowinger, TBMeier, HChan, FMadge, DGupta, JB Naphthol derivatives as TRPV1 inhibitors for the treatment of urinary incontinence. Bioorg Med Chem Lett21:3354-7 (2011) 
 
Transient receptor potential cation channel subfamily V member 1
Name:Transient receptor potential cation channel subfamily V member 1
Type:Protein
Mol. Mass.:94960.75
Organism:Homo sapiens (Human)
Description:Q8NER1
Residue:839
BDBM50344374
NameBDBM50344374
Synonyms:1-(4-chloro-3-(trifluoromethyl)phenyl)-3-(7-hydroxy-1,2,3,4-tetrahydronaphthalen-1-yl)urea | CHEMBL1779836
TypeSmall organic molecule
Emp. Form.C18H16ClF3N2O2
Mol. Mass.384.78
SMILESOc1ccc2CCCC(NC(=O)Nc3ccc(Cl)c(c3)C(F)(F)F)c2c1