Reaction Details
TargetTransient receptor potential cation channel subfamily V member 1
LigandBDBM50344344
Substrate/Competitorn/a
Meas. Tech.ChEMBL_748632 (CHEMBL1780485)
IC50 87±n/a nM
Citation Urbahns, KYura, TMogi, MTajimi, MFujishima, HMasuda, TYoshida, NMoriwaki, TLowinger, TBMeier, HChan, FMadge, DGupta, JB Naphthol derivatives as TRPV1 inhibitors for the treatment of urinary incontinence. Bioorg Med Chem Lett21:3354-7 (2011) 
 
Transient receptor potential cation channel subfamily V member 1
Name:Transient receptor potential cation channel subfamily V member 1
Type:Protein
Mol. Mass.:94960.75
Organism:Homo sapiens (Human)
Description:Q8NER1
Residue:839
BDBM50344344
NameBDBM50344344
Synonyms:1-(7-hydroxynaphthalen-1-yl)-3-(2-(trifluoromethyl)phenyl)urea | CHEMBL1779664
TypeSmall organic molecule
Emp. Form.C18H13F3N2O2
Mol. Mass.346.3032
SMILESOc1ccc2cccc(NC(=O)Nc3ccccc3C(F)(F)F)c2c1