Reaction Details
TargetTransient receptor potential cation channel subfamily V member 1
LigandBDBM50344361
Substrate/Competitorn/a
Meas. Tech.ChEMBL_748632 (CHEMBL1780485)
IC50 24±n/a nM
Citation Urbahns, KYura, TMogi, MTajimi, MFujishima, HMasuda, TYoshida, NMoriwaki, TLowinger, TBMeier, HChan, FMadge, DGupta, JB Naphthol derivatives as TRPV1 inhibitors for the treatment of urinary incontinence. Bioorg Med Chem Lett21:3354-7 (2011) 
 
Transient receptor potential cation channel subfamily V member 1
Name:Transient receptor potential cation channel subfamily V member 1
Type:Protein
Mol. Mass.:94960.75
Organism:Homo sapiens (Human)
Description:Q8NER1
Residue:839
BDBM50344361
NameBDBM50344361
Synonyms:1-(2,5-dichlorophenyl)-3-(7-hydroxynaphthalen-1-yl)urea | CHEMBL1779681
TypeSmall organic molecule
Emp. Form.C17H12Cl2N2O2
Mol. Mass.347.195
SMILESOc1ccc2cccc(NC(=O)Nc3cc(Cl)ccc3Cl)c2c1