Reaction Details
TargetTransient receptor potential cation channel subfamily V member 1
LigandBDBM50344371
Substrate/Competitorn/a
Meas. Tech.ChEMBL_748632 (CHEMBL1780485)
IC50>1000±n/a nM
Citation Urbahns, KYura, TMogi, MTajimi, MFujishima, HMasuda, TYoshida, NMoriwaki, TLowinger, TBMeier, HChan, FMadge, DGupta, JB Naphthol derivatives as TRPV1 inhibitors for the treatment of urinary incontinence. Bioorg Med Chem Lett21:3354-7 (2011) 
 
Transient receptor potential cation channel subfamily V member 1
Name:Transient receptor potential cation channel subfamily V member 1
Type:Protein
Mol. Mass.:94960.75
Organism:Homo sapiens (Human)
Description:Q8NER1
Residue:839
BDBM50344371
NameBDBM50344371
Synonyms:2-(3-fluorophenyl)-N-(7-hydroxynaphthalen-1-yl)acetamide | CHEMBL1779835
TypeSmall organic molecule
Emp. Form.C18H14FNO2
Mol. Mass.295.3077
SMILESOc1ccc2cccc(NC(=O)Cc3cccc(F)c3)c2c1