Reaction Details
TargetTransient receptor potential cation channel subfamily V member 1
LigandBDBM50344367
Substrate/Competitorn/a
Meas. Tech.ChEMBL_748632 (CHEMBL1780485)
IC50 2.2±n/a nM
Citation Urbahns, KYura, TMogi, MTajimi, MFujishima, HMasuda, TYoshida, NMoriwaki, TLowinger, TBMeier, HChan, FMadge, DGupta, JB Naphthol derivatives as TRPV1 inhibitors for the treatment of urinary incontinence. Bioorg Med Chem Lett21:3354-7 (2011) 
 
Transient receptor potential cation channel subfamily V member 1
Name:Transient receptor potential cation channel subfamily V member 1
Type:Protein
Mol. Mass.:94960.75
Organism:Homo sapiens (Human)
Description:Q8NER1
Residue:839
BDBM50344367
NameBDBM50344367
Synonyms:1-(4-chloro-3-(trifluoromethyl)phenyl)-3-(7-hydroxynaphthalen-1-yl)urea | CHEMBL1779687
TypeSmall organic molecule
Emp. Form.C18H12ClF3N2O2
Mol. Mass.380.748
SMILESOc1ccc2cccc(NC(=O)Nc3ccc(Cl)c(c3)C(F)(F)F)c2c1