Reaction Details
TargetTransient receptor potential cation channel subfamily V member 1
LigandBDBM50344353
Substrate/Competitorn/a
Meas. Tech.ChEMBL_748632 (CHEMBL1780485)
IC50 7.5±n/a nM
Citation Urbahns, KYura, TMogi, MTajimi, MFujishima, HMasuda, TYoshida, NMoriwaki, TLowinger, TBMeier, HChan, FMadge, DGupta, JB Naphthol derivatives as TRPV1 inhibitors for the treatment of urinary incontinence. Bioorg Med Chem Lett21:3354-7 (2011) 
 
Transient receptor potential cation channel subfamily V member 1
Name:Transient receptor potential cation channel subfamily V member 1
Type:Protein
Mol. Mass.:94960.75
Organism:Homo sapiens (Human)
Description:Q8NER1
Residue:839
BDBM50344353
NameBDBM50344353
Synonyms:1-(7-hydroxynaphthalen-1-yl)-3-(3-nitrophenyl)urea | CHEMBL1779673
TypeSmall organic molecule
Emp. Form.C17H13N3O4
Mol. Mass.323.3028
SMILESOc1ccc2cccc(NC(=O)Nc3cccc(c3)[N+]([O-])=O)c2c1