Reaction Details
TargetTransient receptor potential cation channel subfamily V member 1
LigandBDBM6646
Substrate/Competitorn/a
Meas. Tech.ChEMBL_748631 (CHEMBL1780484)
IC50 53±n/a nM
Citation Urbahns, KYura, TMogi, MTajimi, MFujishima, HMasuda, TYoshida, NMoriwaki, TLowinger, TBMeier, HChan, FMadge, DGupta, JB Naphthol derivatives as TRPV1 inhibitors for the treatment of urinary incontinence. Bioorg Med Chem Lett21:3354-7 (2011) 
 
Transient receptor potential cation channel subfamily V member 1
Name:Transient receptor potential cation channel subfamily V member 1
Type:Transient Receptor
Mol. Mass.:94956.12
Organism:Rattus norvegicus (rat)
Description:O35433
Residue:838
BDBM6646
NameBDBM6646
Synonyms:3-(7-hydroxynaphthalen-1-yl)-1-phenylurea N-(7-Hydroxy-1-naphthyl)-N -phenylurea
TypeSmall organic molecule
Emp. Form.C17H14N2O2
Mol. Mass.278.3053
SMILESOc1ccc2cccc(NC(=O)Nc3ccccc3)c2c1