Reaction Details
TargetTransient receptor potential cation channel subfamily V member 1
LigandBDBM50344349
Substrate/Competitorn/a
Meas. Tech.ChEMBL_748631 (CHEMBL1780484)
IC50 11±n/a nM
Citation Urbahns, KYura, TMogi, MTajimi, MFujishima, HMasuda, TYoshida, NMoriwaki, TLowinger, TBMeier, HChan, FMadge, DGupta, JB Naphthol derivatives as TRPV1 inhibitors for the treatment of urinary incontinence. Bioorg Med Chem Lett21:3354-7 (2011) 
 
Transient receptor potential cation channel subfamily V member 1
Name:Transient receptor potential cation channel subfamily V member 1
Type:Transient Receptor
Mol. Mass.:94956.12
Organism:Rattus norvegicus (rat)
Description:O35433
Residue:838
BDBM50344349
NameBDBM50344349
Synonyms:1-(4-chlorophenyl)-3-(7-hydroxynaphthalen-1-yl)urea | CHEMBL1779669
TypeSmall organic molecule
Emp. Form.C17H13ClN2O2
Mol. Mass.312.75
SMILESOc1ccc2cccc(NC(=O)Nc3ccc(Cl)cc3)c2c1