Reaction Details
TargetTransient receptor potential cation channel subfamily V member 1
LigandBDBM50344350
Substrate/Competitorn/a
Meas. Tech.ChEMBL_748631 (CHEMBL1780484)
IC50 19±n/a nM
Citation Urbahns, KYura, TMogi, MTajimi, MFujishima, HMasuda, TYoshida, NMoriwaki, TLowinger, TBMeier, HChan, FMadge, DGupta, JB Naphthol derivatives as TRPV1 inhibitors for the treatment of urinary incontinence. Bioorg Med Chem Lett21:3354-7 (2011) 
 
Transient receptor potential cation channel subfamily V member 1
Name:Transient receptor potential cation channel subfamily V member 1
Type:Transient Receptor
Mol. Mass.:94956.12
Organism:Rattus norvegicus (rat)
Description:O35433
Residue:838
BDBM50344350
NameBDBM50344350
Synonyms:1-(7-hydroxynaphthalen-1-yl)-3-m-tolylurea | CHEMBL1779670
TypeSmall organic molecule
Emp. Form.C18H16N2O2
Mol. Mass.292.3318
SMILESCc1cccc(NC(=O)Nc2cccc3ccc(O)cc23)c1