Reaction Details
TargetTransient receptor potential cation channel subfamily V member 1
LigandBDBM50344352
Substrate/Competitorn/a
Meas. Tech.ChEMBL_748631 (CHEMBL1780484)
IC50 8.6±n/a nM
Citation Urbahns, KYura, TMogi, MTajimi, MFujishima, HMasuda, TYoshida, NMoriwaki, TLowinger, TBMeier, HChan, FMadge, DGupta, JB Naphthol derivatives as TRPV1 inhibitors for the treatment of urinary incontinence. Bioorg Med Chem Lett21:3354-7 (2011) 
 
Transient receptor potential cation channel subfamily V member 1
Name:Transient receptor potential cation channel subfamily V member 1
Type:Transient Receptor
Mol. Mass.:94956.12
Organism:Rattus norvegicus (rat)
Description:O35433
Residue:838
BDBM50344352
NameBDBM50344352
Synonyms:1-(7-hydroxynaphthalen-1-yl)-3-(3-methoxyphenyl)urea | CHEMBL1779672
TypeSmall organic molecule
Emp. Form.C18H16N2O3
Mol. Mass.308.3312
SMILESCOc1cccc(NC(=O)Nc2cccc3ccc(O)cc23)c1