Reaction Details
TargetTransient receptor potential cation channel subfamily V member 1
LigandBDBM50344359
Substrate/Competitorn/a
Meas. Tech.ChEMBL_748631 (CHEMBL1780484)
IC50 270±n/a nM
Citation Urbahns, KYura, TMogi, MTajimi, MFujishima, HMasuda, TYoshida, NMoriwaki, TLowinger, TBMeier, HChan, FMadge, DGupta, JB Naphthol derivatives as TRPV1 inhibitors for the treatment of urinary incontinence. Bioorg Med Chem Lett21:3354-7 (2011) 
 
Transient receptor potential cation channel subfamily V member 1
Name:Transient receptor potential cation channel subfamily V member 1
Type:Transient Receptor
Mol. Mass.:94956.12
Organism:Rattus norvegicus (rat)
Description:O35433
Residue:838
BDBM50344359
NameBDBM50344359
Synonyms:3-(3-(7-hydroxynaphthalen-1-yl)ureido)benzoic acid | CHEMBL1779679
TypeSmall organic molecule
Emp. Form.C18H14N2O4
Mol. Mass.322.3148
SMILESOC(=O)c1cccc(NC(=O)Nc2cccc3ccc(O)cc23)c1