Reaction Details
TargetTransient receptor potential cation channel subfamily V member 1
LigandBDBM50344365
Substrate/Competitorn/a
Meas. Tech.ChEMBL_748631 (CHEMBL1780484)
IC50 19±n/a nM
Citation Urbahns, KYura, TMogi, MTajimi, MFujishima, HMasuda, TYoshida, NMoriwaki, TLowinger, TBMeier, HChan, FMadge, DGupta, JB Naphthol derivatives as TRPV1 inhibitors for the treatment of urinary incontinence. Bioorg Med Chem Lett21:3354-7 (2011) 
 
Transient receptor potential cation channel subfamily V member 1
Name:Transient receptor potential cation channel subfamily V member 1
Type:Transient Receptor
Mol. Mass.:94956.12
Organism:Rattus norvegicus (rat)
Description:O35433
Residue:838
BDBM50344365
NameBDBM50344365
Synonyms:1-(4-chloro-2-(trifluoromethyl)phenyl)-3-(7-hydroxynaphthalen-1-yl)urea | CHEMBL1779685
TypeSmall organic molecule
Emp. Form.C18H12ClF3N2O2
Mol. Mass.380.748
SMILESOc1ccc2cccc(NC(=O)Nc3ccc(Cl)cc3C(F)(F)F)c2c1