Reaction Details
TargetTransient receptor potential cation channel subfamily V member 1
LigandBDBM50344372
Substrate/Competitorn/a
Meas. Tech.ChEMBL_748631 (CHEMBL1780484)
IC50 4.9±n/a nM
Citation Urbahns, KYura, TMogi, MTajimi, MFujishima, HMasuda, TYoshida, NMoriwaki, TLowinger, TBMeier, HChan, FMadge, DGupta, JB Naphthol derivatives as TRPV1 inhibitors for the treatment of urinary incontinence. Bioorg Med Chem Lett21:3354-7 (2011) 
 
Transient receptor potential cation channel subfamily V member 1
Name:Transient receptor potential cation channel subfamily V member 1
Type:Transient Receptor
Mol. Mass.:94956.12
Organism:Rattus norvegicus (rat)
Description:O35433
Residue:838
BDBM50344372
NameBDBM50344372
Synonyms:1-(3-bromo-2-chloro-7-hydroxynaphthalen-1-yl)-3-(4-chloro-3-(trifluoromethyl)phenyl)urea | CHEMBL1779841
TypeSmall organic molecule
Emp. Form.C18H10BrCl2F3N2O2
Mol. Mass.494.089
SMILESOc1ccc2cc(Br)c(Cl)c(NC(=O)Nc3ccc(Cl)c(c3)C(F)(F)F)c2c1