Reaction Details
TargetTransient receptor potential cation channel subfamily V member 1
LigandBDBM50344375
Substrate/Competitorn/a
Meas. Tech.ChEMBL_748631 (CHEMBL1780484)
IC50>1000±n/a nM
Citation Urbahns, KYura, TMogi, MTajimi, MFujishima, HMasuda, TYoshida, NMoriwaki, TLowinger, TBMeier, HChan, FMadge, DGupta, JB Naphthol derivatives as TRPV1 inhibitors for the treatment of urinary incontinence. Bioorg Med Chem Lett21:3354-7 (2011) 
 
Transient receptor potential cation channel subfamily V member 1
Name:Transient receptor potential cation channel subfamily V member 1
Type:Transient Receptor
Mol. Mass.:94956.12
Organism:Rattus norvegicus (rat)
Description:O35433
Residue:838
BDBM50344375
NameBDBM50344375
Synonyms:1-(3-fluorophenyl)-3-(3-hydroxybenzyl)urea | CHEMBL1779837
TypeSmall organic molecule
Emp. Form.C14H13FN2O2
Mol. Mass.260.2636
SMILESOc1cccc(CNC(=O)Nc2cccc(F)c2)c1