Reaction Details
TargetTransient receptor potential cation channel subfamily V member 1
LigandBDBM50344376
Substrate/Competitorn/a
Meas. Tech.ChEMBL_748631 (CHEMBL1780484)
IC50 19±n/a nM
Citation Urbahns, KYura, TMogi, MTajimi, MFujishima, HMasuda, TYoshida, NMoriwaki, TLowinger, TBMeier, HChan, FMadge, DGupta, JB Naphthol derivatives as TRPV1 inhibitors for the treatment of urinary incontinence. Bioorg Med Chem Lett21:3354-7 (2011) 
 
Transient receptor potential cation channel subfamily V member 1
Name:Transient receptor potential cation channel subfamily V member 1
Type:Transient Receptor
Mol. Mass.:94956.12
Organism:Rattus norvegicus (rat)
Description:O35433
Residue:838
BDBM50344376
NameBDBM50344376
Synonyms:1-(4-chloro-3-(trifluoromethyl)phenyl)-3-(7-methoxynaphthalen-1-yl)urea | CHEMBL1779838
TypeSmall organic molecule
Emp. Form.C19H14ClF3N2O2
Mol. Mass.394.775
SMILESCOc1ccc2cccc(NC(=O)Nc3ccc(Cl)c(c3)C(F)(F)F)c2c1