Reaction Details
TargetRAF proto-oncogene serine/threonine-protein kinase
LigandBDBM50344548
Substrate/Competitorn/a
Meas. Tech.ChEMBL_747956 (CHEMBL1781333)
IC50 1±n/a nM
Citation Ramurthy, SAikawa, MAmiri, PCostales, AHashash, AJansen, JMLin, SMa, SRenhowe, PAShafer, CMSubramanian, SSung, LVerhagen, J Design and synthesis of 5,6-fused heterocyclic amides as Raf kinase inhibitors. Bioorg Med Chem Lett21:3286-9 (2011) 
 
RAF proto-oncogene serine/threonine-protein kinase
Name:RAF proto-oncogene serine/threonine-protein kinase
Type:Serine/threonine-protein kinase
Mol. Mass.:73082.52
Organism:Homo sapiens (Human)
Description:P04049
Residue:648
BDBM50344548
NameBDBM50344548
Synonyms:4-(2-(3-tert-butyl phenylamino)benzo[d]oxazol-5-yloxy)-N-methylpicolinamide | CHEMBL1778291
TypeSmall organic molecule
Emp. Form.C24H24N4O3
Mol. Mass.416.4724
SMILESCNC(=O)c1cc(Oc2ccc3oc(Nc4cccc(c4)C(C)(C)C)nc3c2)ccn1