Reaction Details
TargetDipeptidyl peptidase 4
LigandBDBM50344781
Substrate/Competitorn/a
Meas. Tech.ChEMBL_749181 (CHEMBL1780909)
IC50 11±n/a nM
Citation Kim, HJKwak, WYMin, JPLee, JYYoon, THKim, HDShin, CYKim, MKChoi, SHKim, HSYang, EKCheong, YHChae, YNPark, KJJang, JMChoi, SJSon, MHKim, SHYoo, MLee, BJ Discovery of DA-1229: a potent, long acting dipeptidyl peptidase-4 inhibitor for the treatment of type 2 diabetes. Bioorg Med Chem Lett21:3809-12 (2011) 
 
Dipeptidyl peptidase 4
Name:Dipeptidyl peptidase 4
Type:Enzyme
Mol. Mass.:88271.01
Organism:Homo sapiens (Human)
Description:P27487
Residue:766
BDBM50344781
NameBDBM50344781
Synonyms:(R)-4-((R)-3-amino-4-(2,4,5-trifluorophenyl)butanoyl)-3-((diethylamino)methyl)piperazin-2-one | CHEMBL1779712
TypeSmall organic molecule
Emp. Form.C19H27F3N4O2
Mol. Mass.400.4385
SMILESCCN(CC)C[C@H]1N(CCNC1=O)C(=O)C[C@H](N)Cc1cc(F)c(F)cc1F