Reaction Details
TargetDipeptidyl peptidase 4
LigandBDBM50344782
Substrate/Competitorn/a
Meas. Tech.ChEMBL_749181 (CHEMBL1780909)
IC50 5.2±n/a nM
Citation Kim, HJKwak, WYMin, JPLee, JYYoon, THKim, HDShin, CYKim, MKChoi, SHKim, HSYang, EKCheong, YHChae, YNPark, KJJang, JMChoi, SJSon, MHKim, SHYoo, MLee, BJ Discovery of DA-1229: a potent, long acting dipeptidyl peptidase-4 inhibitor for the treatment of type 2 diabetes. Bioorg Med Chem Lett21:3809-12 (2011) 
 
Dipeptidyl peptidase 4
Name:Dipeptidyl peptidase 4
Type:Enzyme
Mol. Mass.:88271.01
Organism:Homo sapiens (Human)
Description:P27487
Residue:766
BDBM50344782
NameBDBM50344782
Synonyms:(R)-4-((R)-3-amino-4-(2,4,5-trifluorophenyl)butanoyl)-3-(morpholinomethyl)piperazin-2-one | CHEMBL1779713
TypeSmall organic molecule
Emp. Form.C19H25F3N4O3
Mol. Mass.414.422
SMILESN[C@@H](CC(=O)N1CCNC(=O)[C@H]1CN1CCOCC1)Cc1cc(F)c(F)cc1F