Reaction Details
TargetVasopressin V1b receptor
LigandBDBM50345069
Substrate/Competitorn/a
Meas. Tech.ChEMBL_748689 (CHEMBL1780542)
Ki 630±n/a nM
Citation Baker, JBingham, MBlackburn-Munro, RCai, JCraighead, MGilfillan, RGoan, KJaap, DMilne, RMorphy, JRNapier, SPresland, JSpinks, GThomson, F Identification and optimisation of novel sulfonamide, selective vasopressin V1B receptor antagonists. Bioorg Med Chem Lett21:3603-7 (2011) 
 
Vasopressin V1b receptor
Name:Vasopressin V1b receptor
Type:Enzyme
Mol. Mass.:46985.01
Organism:Homo sapiens (Human)
Description:P47901
Residue:424
BDBM50345069
NameBDBM50345069
Synonyms:(S)-2-(4-methoxy-2,3,6-trimethylphenylsulfonamido)-N-((S)-1-oxo-3-phenyl-1-(piperidin-1-yl)propan-2-yl)-3-phenylpropanamide | CHEMBL1779124
TypeSmall organic molecule
Emp. Form.C33H41N3O5S
Mol. Mass.591.761
SMILESCOc1cc(C)c(c(C)c1C)S(=O)(=O)N[C@@H](Cc1ccccc1)C(=O)N[C@@H](Cc1ccccc1)C(=O)N1CCCCC1