Reaction Details
TargetVasopressin V1b receptor
LigandBDBM50345082
Substrate/Competitorn/a
Meas. Tech.ChEMBL_748689 (CHEMBL1780542)
Ki 180±n/a nM
Citation Baker, JBingham, MBlackburn-Munro, RCai, JCraighead, MGilfillan, RGoan, KJaap, DMilne, RMorphy, JRNapier, SPresland, JSpinks, GThomson, F Identification and optimisation of novel sulfonamide, selective vasopressin V1B receptor antagonists. Bioorg Med Chem Lett21:3603-7 (2011) 
 
Vasopressin V1b receptor
Name:Vasopressin V1b receptor
Type:Enzyme
Mol. Mass.:46985.01
Organism:Homo sapiens (Human)
Description:P47901
Residue:424
BDBM50345082
NameBDBM50345082
Synonyms:1-(1,4-diazepan-1-yl)-2-(5-methoxy-1-(4-methoxy-2,3-dimethylphenylsulfonyl)-2-methyl-1H-indol-3-yl)ethanone | CHEMBL1779235
TypeSmall organic molecule
Emp. Form.C26H33N3O5S
Mol. Mass.499.622
SMILESCOc1ccc2n(c(C)c(CC(=O)N3CCCNCC3)c2c1)S(=O)(=O)c1ccc(OC)c(C)c1C