Reaction Details
TargetVasopressin V1b receptor
LigandBDBM50345083
Substrate/Competitorn/a
Meas. Tech.ChEMBL_748689 (CHEMBL1780542)
Ki 430±n/a nM
Citation Baker, JBingham, MBlackburn-Munro, RCai, JCraighead, MGilfillan, RGoan, KJaap, DMilne, RMorphy, JRNapier, SPresland, JSpinks, GThomson, F Identification and optimisation of novel sulfonamide, selective vasopressin V1B receptor antagonists. Bioorg Med Chem Lett21:3603-7 (2011) 
 
Vasopressin V1b receptor
Name:Vasopressin V1b receptor
Type:Enzyme
Mol. Mass.:46985.01
Organism:Homo sapiens (Human)
Description:P47901
Residue:424
BDBM50345083
NameBDBM50345083
Synonyms:2-(5-fluoro-1-(4-methoxy-2,3-dimethylphenylsulfonyl)-2-methyl-1H-indol-3-yl)-N-(3-(4-methylpiperazin-1-yl)propyl)acetamide | CHEMBL1779236
TypeSmall organic molecule
Emp. Form.C28H37FN4O4S
Mol. Mass.544.681
SMILESCOc1ccc(c(C)c1C)S(=O)(=O)n1c(C)c(CC(=O)NCCCN2CCN(C)CC2)c2cc(F)ccc12