Reaction Details
TargetVasopressin V1b receptor
LigandBDBM50345085
Substrate/Competitorn/a
Meas. Tech.ChEMBL_748689 (CHEMBL1780542)
Ki 63±n/a nM
Citation Baker, JBingham, MBlackburn-Munro, RCai, JCraighead, MGilfillan, RGoan, KJaap, DMilne, RMorphy, JRNapier, SPresland, JSpinks, GThomson, F Identification and optimisation of novel sulfonamide, selective vasopressin V1B receptor antagonists. Bioorg Med Chem Lett21:3603-7 (2011) 
 
Vasopressin V1b receptor
Name:Vasopressin V1b receptor
Type:Enzyme
Mol. Mass.:46985.01
Organism:Homo sapiens (Human)
Description:P47901
Residue:424
BDBM50345085
NameBDBM50345085
Synonyms:(2S)-N-(3-(1-aminoisoquinolin-6-yl)-1-oxo-1-(piperidin-1-yl)propan-2-yl)-2-(4-methoxy-2,3,6-trimethylphenylsulfonamido)-3-phenylpropanamide | CHEMBL1779238
TypeSmall organic molecule
Emp. Form.C36H43N5O5S
Mol. Mass.657.822
SMILESCOc1cc(C)c(c(C)c1C)S(=O)(=O)N[C@@H](Cc1ccccc1)C(=O)NC(Cc1ccc2c(N)nccc2c1)C(=O)N1CCCCC1