Reaction Details
TargetHeat shock protein HSP 90-alpha
LigandBDBM50345156
Substrate/Competitorn/a
Meas. Tech.ChEMBL_748762 (CHEMBL1780615)
IC50 201±n/a nM
Citation Zapf, CWBloom, JDMcBean, JLDushin, RGGolas, JMLiu, HLucas, JBoschelli, FVogan, ELevin, JI Discovery of a macrocyclic o-aminobenzamide Hsp90 inhibitor with heterocyclic tether that shows extended biomarker activity and in vivo efficacy in a mouse xenograft model. Bioorg Med Chem Lett21:3627-31 (2011) 
 
Heat shock protein HSP 90-alpha
Name:Heat shock protein HSP 90-alpha
Type:Molecular Chaperone
Mol. Mass.:84623.45
Organism:Homo sapiens (Human)
Description:P07900
Residue:732
BDBM50345156
NameBDBM50345156
Synonyms:CHEMBL1779536
TypeSmall organic molecule
Emp. Form.C26H34N4O2
Mol. Mass.434.5738
SMILESCc1c2CCCN3CC[C@@H](C3)CNc3cc(ccc3C(N)=O)-n2c2CC(C)(C)CC(=O)c12