Reaction Details
TargetPotassium voltage-gated channel subfamily H member 2
LigandBDBM50345167
Substrate/Competitorn/a
Meas. Tech.ChEMBL_748773 (CHEMBL1780626)
IC50 3400±n/a nM
Citation Zapf, CWBloom, JDMcBean, JLDushin, RGGolas, JMLiu, HLucas, JBoschelli, FVogan, ELevin, JI Discovery of a macrocyclic o-aminobenzamide Hsp90 inhibitor with heterocyclic tether that shows extended biomarker activity and in vivo efficacy in a mouse xenograft model. Bioorg Med Chem Lett21:3627-31 (2011) 
 
Potassium voltage-gated channel subfamily H member 2
Name:Potassium voltage-gated channel subfamily H member 2
Type:Multi-pass membrane protein
Mol. Mass.:126672.65
Organism:Homo sapiens (Human)
Description:Q12809
Residue:1159
BDBM50345167
NameBDBM50345167
Synonyms:CHEMBL1779547
TypeSmall organic molecule
Emp. Form.C26H34N4O2
Mol. Mass.434.5738
SMILESCc1c2CCCN3CCC[C@@H](C3)Nc3cc(ccc3C(N)=O)-n2c2CC(C)(C)CC(=O)c12