Reaction Details
TargetDihydroorotate dehydrogenase (quinone), mitochondrial
LigandBDBM50345420
Substrate/Competitorn/a
Meas. Tech.ChEMBL_751786 (CHEMBL1785541)
IC50 78±n/a nM
Citation Gujjar, REl Mazouni, FWhite, KLWhite, JCreason, SShackleford, DMDeng, XCharman, WNBathurst, IBurrows, JFloyd, DMMatthews, DBuckner, FSCharman, SAPhillips, MARathod, PK Lead optimization of aryl and aralkyl amine-based triazolopyrimidine inhibitors of Plasmodium falciparum dihydroorotate dehydrogenase with antimalarial activity in mice. J Med Chem54:3935-49 (2011) 
 
Dihydroorotate dehydrogenase (quinone), mitochondrial
Name:Dihydroorotate dehydrogenase (quinone), mitochondrial
Type:Enzyme
Mol. Mass.:65581.88
Organism:Plasmodium falciparum
Description:His6-tag DHODH was expressed in E. coli.
Residue:569
BDBM50345420
NameBDBM50345420
Synonyms:CHEMBL1784561 | N-(4-tert-Butylphenyl)-5-methyl-[1,2,4]triazolo[1,5-a]pyrimidin-7-amine
TypeSmall organic molecule
Emp. Form.C16H19N5
Mol. Mass.281.3556
SMILESCc1cc(Nc2ccc(cc2)C(C)(C)C)n2ncnc2n1