Reaction Details
TargetSubstance-P receptor
LigandBDBM50346326
Substrate/Competitorn/a
Meas. Tech.ChEMBL_749283 (CHEMBL1785218)
Ki 32±n/a nM
Citation Ballet, SFeytens, DBuysse, KChung, NNLemieux, CTumati, SKeresztes, AVan Duppen, JLai, JVarga, EPorreca, FSchiller, PWVanden Broeck, JTourwé, D Design of novel neurokinin 1 receptor antagonists based on conformationally constrained aromatic amino acids and discovery of a potent chimeric opioid agonist-neurokinin 1 receptor antagonist. J Med Chem54:2467-76 (2011) 
 
Substance-P receptor
Name:Substance-P receptor
Type:G Protein-Coupled Receptor (GPCR)
Mol. Mass.:46254.43
Organism:Homo sapiens (Human)
Description:P25103
Residue:407
BDBM50346326
NameBDBM50346326
Synonyms:(S)-2-acetyl-N-(3,5-bis(trifluoromethyl)benzyl)-N-methyl-1,2,3,4-tetrahydroisoquinoline-3-carboxamide | CHEMBL1782137
TypeSmall organic molecule
Emp. Form.C22H20F6N2O2
Mol. Mass.458.3968
SMILESCN(Cc1cc(cc(c1)C(F)(F)F)C(F)(F)F)C(=O)[C@@H]1Cc2ccccc2CN1C(C)=O