Reaction Details
TargetAminopeptidase N
LigandBDBM50346448
Substrate/Competitorn/a
Meas. Tech.ChEMBL_751649 (CHEMBL1787847)
Ki 240±n/a nM
Citation Andersson, HDemaegdt, HJohnsson, AVauquelin, GLindeberg, GHallberg, MErdelyi, MKarlen, AHallberg, A Potent macrocyclic inhibitors of insulin-regulated aminopeptidase (IRAP) by olefin ring-closing metathesis. J Med Chem54:3779-92 (2011) 
 
Aminopeptidase N
Name:Aminopeptidase N
Type:PROTEIN
Mol. Mass.:109522.63
Organism:Homo sapiens (Human)
Description:ChEMBL_1507526
Residue:967
BDBM50346448
NameBDBM50346448
Synonyms:2-(2-(((2S,6S,13S,E)-13-Amino-2-(4-hydroxybenzyl)-4,14-dioxo-1,5-diazacyclotetradec-9-ene-6-carboxamido)methyl)phenyl)acetic Acid | CHEMBL1782887
TypeSmall organic molecule
Emp. Form.C29H36N4O6
Mol. Mass.536.6193
SMILESN[C@H]1CC\C=C\CC[C@H](NC(=O)C[C@H](Cc2ccc(O)cc2)NC1=O)C(=O)NCc1ccccc1CC(O)=O