Reaction Details
TargetLeucyl-cystinyl aminopeptidase
LigandBDBM85550
Substrate/Competitorn/a
Meas. Tech.ChEMBL_751648 (CHEMBL1787846)
Ki 62.4±n/a nM
Citation Andersson, HDemaegdt, HJohnsson, AVauquelin, GLindeberg, GHallberg, MErdelyi, MKarlen, AHallberg, A Potent macrocyclic inhibitors of insulin-regulated aminopeptidase (IRAP) by olefin ring-closing metathesis. J Med Chem54:3779-92 (2011) 
 
Leucyl-cystinyl aminopeptidase
Name:Leucyl-cystinyl aminopeptidase
Type:PROTEIN
Mol. Mass.:117334.10
Organism:Homo sapiens (Human)
Description:ChEMBL_1473494
Residue:1025
BDBM85550
NameBDBM85550
Synonyms:Ang IV CHEMBL261120 | cid_123814
TypeSmall organic molecule
Emp. Form.C40H54N8O8
Mol. Mass.774.9056
SMILESCC[C@H](C)[C@H](NC(=O)[C@H](Cc1ccc(O)cc1)NC(=O)[C@@H](N)C(C)C)C(=O)N[C@@H](Cc1cnc[nH]1)C(=O)N1CCC[C@H]1C(=O)N[C@@H](Cc1ccccc1)C(O)=O