Reaction Details
TargetLeucyl-cystinyl aminopeptidase
LigandBDBM50346453
Substrate/Competitorn/a
Meas. Tech.ChEMBL_751648 (CHEMBL1787846)
Ki 64.2±n/a nM
Citation Andersson, HDemaegdt, HJohnsson, AVauquelin, GLindeberg, GHallberg, MErdelyi, MKarlen, AHallberg, A Potent macrocyclic inhibitors of insulin-regulated aminopeptidase (IRAP) by olefin ring-closing metathesis. J Med Chem54:3779-92 (2011) 
 
Leucyl-cystinyl aminopeptidase
Name:Leucyl-cystinyl aminopeptidase
Type:PROTEIN
Mol. Mass.:117334.10
Organism:Homo sapiens (Human)
Description:ChEMBL_1473494
Residue:1025
BDBM50346453
NameBDBM50346453
Synonyms:2-(2-(((2S,5S,12S)-12-amino-2-(4-hydroxybenzyl)-3,13-dioxo-1,4-diazacyclotridecane-5-carboxamido)methyl)phenyl)acetic acid | CHEMBL1782883
TypeSmall organic molecule
Emp. Form.C28H36N4O6
Mol. Mass.524.6086
SMILESN[C@H]1CCCCCC[C@H](NC(=O)[C@H](Cc2ccc(O)cc2)NC1=O)C(=O)NCc1ccccc1CC(O)=O