Reaction Details
TargetMitogen-activated protein kinase 14
LigandBDBM50314073
Substrate/Competitorn/a
Meas. Tech.ChEMBL_752779 (CHEMBL1798415)
Ki 2.9±n/a nM
Citation Devadas, BSelness, SRXing, LMadsen, HMMarrufo, LDShieh, HMessing, DMYang, JZMorgan, HMAnderson, GDWebb, EGZhang, JDevraj, RVMonahan, JB Substituted N-aryl-6-pyrimidinones: a new class of potent, selective, and orally active p38 MAP kinase inhibitors. Bioorg Med Chem Lett21:3856-60 (2011) 
 
Mitogen-activated protein kinase 14
Name:Mitogen-activated protein kinase 14
Type:Serine/threonine-protein kinase
Mol. Mass.:41286.76
Organism:Homo sapiens (Human)
Description:Q16539
Residue:360
BDBM50314073
NameBDBM50314073
Synonyms:3-(3-bromo-4-(2,4-difluorobenzyloxy)-6-methyl-2-oxopyridin-1(2H)-yl)-N,4-dimethylbenzamide CHEMBL1088751 PH-797804 | PHA-797804
TypeSmall organic molecule
Emp. Form.C22H19BrF2N2O3
Mol. Mass.477.299
SMILESCNC(=O)c1ccc(C)c(c1)-n1c(C)cc(OCc2ccc(F)cc2F)c(Br)c1=O