Reaction Details
TargetMitogen-activated protein kinase 14
LigandBDBM50346921
Substrate/Competitorn/a
Meas. Tech.ChEMBL_752865 (CHEMBL1798599)
IC50 30±n/a nM
Citation Devadas, BSelness, SRXing, LMadsen, HMMarrufo, LDShieh, HMessing, DMYang, JZMorgan, HMAnderson, GDWebb, EGZhang, JDevraj, RVMonahan, JB Substituted N-aryl-6-pyrimidinones: a new class of potent, selective, and orally active p38 MAP kinase inhibitors. Bioorg Med Chem Lett21:3856-60 (2011) 
 
Mitogen-activated protein kinase 14
Name:Mitogen-activated protein kinase 14
Type:Serine/threonine-protein kinase
Mol. Mass.:41286.76
Organism:Homo sapiens (Human)
Description:Q16539
Residue:360
BDBM50346921
NameBDBM50346921
Synonyms:CHEMBL1795681
TypeSmall organic molecule
Emp. Form.C21H17ClF2N4O4
Mol. Mass.462.834
SMILESCc1ccc(cc1-n1cnc(OCc2ccc(F)cc2F)c(Cl)c1=O)C(=O)NCC(N)=O