Reaction Details
TargetcAMP-specific 3',5'-cyclic phosphodiesterase 4A
LigandBDBM50347345
Substrate/Competitorn/a
Meas. Tech.ChEMBL_755117 (CHEMBL1805697)
IC50 0.52±n/a nM
Citation Gallant, MAspiotis, RDay, SDias, RDubé, DDubé, LFriesen, RWGirard, MGuay, DHamel, PHuang, ZLacombe, PLaliberté, SLévesque, JFLiu, SMacdonald, DMancini, JNicholson, DWStyhler, ATownson, KWaters, KYoung, RNGirard, Y Discovery of MK-0952, a selective PDE4 inhibitor for the treatment of long-term memory loss and mild cognitive impairment. Bioorg Med Chem Lett20:6387-93 (2010) 
 
cAMP-specific 3',5'-cyclic phosphodiesterase 4A
Name:cAMP-specific 3',5'-cyclic phosphodiesterase 4A
Type:Enzyme
Mol. Mass.:98113.27
Organism:Homo sapiens (Human)
Description:P27815
Residue:886
BDBM50347345
NameBDBM50347345
Synonyms:CHEMBL1801157
TypeSmall organic molecule
Emp. Form.C29H25N3O4
Mol. Mass.479.5265
SMILESOC(=O)C1CC1c1ccc(cc1)-c1cccc(c1)-n1cc(C(=O)NC2CCC2)c(=O)c2cccnc12