Reaction Details
TargetcAMP-specific 3',5'-cyclic phosphodiesterase 4A
LigandBDBM50347346
Substrate/Competitorn/a
Meas. Tech.ChEMBL_755117 (CHEMBL1805697)
IC50 1±n/a nM
Citation Gallant, MAspiotis, RDay, SDias, RDubé, DDubé, LFriesen, RWGirard, MGuay, DHamel, PHuang, ZLacombe, PLaliberté, SLévesque, JFLiu, SMacdonald, DMancini, JNicholson, DWStyhler, ATownson, KWaters, KYoung, RNGirard, Y Discovery of MK-0952, a selective PDE4 inhibitor for the treatment of long-term memory loss and mild cognitive impairment. Bioorg Med Chem Lett20:6387-93 (2010) 
 
cAMP-specific 3',5'-cyclic phosphodiesterase 4A
Name:cAMP-specific 3',5'-cyclic phosphodiesterase 4A
Type:Enzyme
Mol. Mass.:98113.27
Organism:Homo sapiens (Human)
Description:P27815
Residue:886
BDBM50347346
NameBDBM50347346
Synonyms:CHEMBL1801158
TypeSmall organic molecule
Emp. Form.C28H23N3O4
Mol. Mass.465.4999
SMILESOC(=O)[C@@H]1C[C@H]1c1ccc(cc1)-c1cccc(c1)-n1cc(C(=O)NC2CC2)c(=O)c2cccnc12