Reaction Details
TargetcAMP-specific 3',5'-cyclic phosphodiesterase 4D
LigandBDBM50347343
Substrate/Competitorn/a
Meas. Tech.ChEMBL_755119 (CHEMBL1805699)
IC50 0.51±n/a nM
Citation Gallant, MAspiotis, RDay, SDias, RDubé, DDubé, LFriesen, RWGirard, MGuay, DHamel, PHuang, ZLacombe, PLaliberté, SLévesque, JFLiu, SMacdonald, DMancini, JNicholson, DWStyhler, ATownson, KWaters, KYoung, RNGirard, Y Discovery of MK-0952, a selective PDE4 inhibitor for the treatment of long-term memory loss and mild cognitive impairment. Bioorg Med Chem Lett20:6387-93 (2010) 
 
cAMP-specific 3',5'-cyclic phosphodiesterase 4D
Name:cAMP-specific 3',5'-cyclic phosphodiesterase 4D
Type:Protein
Mol. Mass.:91092.69
Organism:Homo sapiens (Human)
Description:Q08499
Residue:809
BDBM50347343
NameBDBM50347343
Synonyms:CHEMBL1801155
TypeSmall organic molecule
Emp. Form.C27H20F3N3O4
Mol. Mass.507.4606
SMILESOC(=O)C1CC1c1ccc(cc1)-c1cccc(c1)-n1cc(C(=O)NCC(F)(F)F)c(=O)c2cccnc12