Reaction Details
TargetCytochrome P450 2C9
LigandBDBM50232731
Substrate/Competitorn/a
Meas. Tech.ChEMBL_755122 (CHEMBL1805702)
IC50 1700±n/a nM
Citation Gallant, MAspiotis, RDay, SDias, RDubé, DDubé, LFriesen, RWGirard, MGuay, DHamel, PHuang, ZLacombe, PLaliberté, SLévesque, JFLiu, SMacdonald, DMancini, JNicholson, DWStyhler, ATownson, KWaters, KYoung, RNGirard, Y Discovery of MK-0952, a selective PDE4 inhibitor for the treatment of long-term memory loss and mild cognitive impairment. Bioorg Med Chem Lett20:6387-93 (2010) 
 
Cytochrome P450 2C9
Name:Cytochrome P450 2C9
Type:Enzyme
Mol. Mass.:55636.33
Organism:Homo sapiens (Human)
Description:P11712
Residue:490
BDBM50232731
NameBDBM50232731
Synonyms:2-{3'-[6-(1-methanesulfonyl-1-methyl-ethyl)-quinolin-8-yl]-biphenyl-4-yl}-cyclopropanecarboxylic acid | CHEMBL253083
TypeSmall organic molecule
Emp. Form.C29H27NO4S
Mol. Mass.485.594
SMILESCC(C)(c1cc(-c2cccc(c2)-c2ccc(cc2)C2CC2C(O)=O)c2ncccc2c1)S(C)(=O)=O