Reaction Details
TargetPotassium voltage-gated channel subfamily H member 2
LigandBDBM50347948
Substrate/Competitorn/a
Meas. Tech.ChEMBL_755804 (CHEMBL1803471)
IC50 19000±n/a nM
Citation Wu, TNagle, AKuhen, KGagaring, KBorboa, RFrancek, CChen, ZPlouffe, DGoh, ALakshminarayana, SBWu, JAng, HQZeng, PKang, MLTan, WTan, MYe, NLin, XCaldwell, CEk, JSkolnik, SLiu, FWang, JChang, JLi, CHollenbeck, TTuntland, TIsbell, JFischli, CBrun, RRottmann, MDartois, VKeller, TDiagana, TWinzeler, EGlynne, RTully, DCChatterjee, AK Imidazolopiperazines: hit to lead optimization of new antimalarial agents. J Med Chem54:5116-30 (2011) 
 
Potassium voltage-gated channel subfamily H member 2
Name:Potassium voltage-gated channel subfamily H member 2
Type:Multi-pass membrane protein
Mol. Mass.:126672.65
Organism:Homo sapiens (Human)
Description:Q12809
Residue:1159
BDBM50347948
NameBDBM50347948
Synonyms:CHEMBL601821 | GNF-PF-5069
TypeSmall organic molecule
Emp. Form.C21H21N5O3
Mol. Mass.391.4231
SMILESNCC(=O)N1CCn2c(C1)nc(c2Nc1ccc2OCOc2c1)-c1ccccc1