Reaction Details
TargetCytochrome P450 3A4
LigandBDBM50347945
Substrate/Competitorn/a
Meas. Tech.ChEMBL_755921 (CHEMBL1803730)
IC50>8900±n/a nM
Citation Wu, TNagle, AKuhen, KGagaring, KBorboa, RFrancek, CChen, ZPlouffe, DGoh, ALakshminarayana, SBWu, JAng, HQZeng, PKang, MLTan, WTan, MYe, NLin, XCaldwell, CEk, JSkolnik, SLiu, FWang, JChang, JLi, CHollenbeck, TTuntland, TIsbell, JFischli, CBrun, RRottmann, MDartois, VKeller, TDiagana, TWinzeler, EGlynne, RTully, DCChatterjee, AK Imidazolopiperazines: hit to lead optimization of new antimalarial agents. J Med Chem54:5116-30 (2011) 
 
Cytochrome P450 3A4
Name:Cytochrome P450 3A4
Type:Enzyme
Mol. Mass.:57349.57
Organism:Homo sapiens (Human)
Description:n/a
Residue:503
BDBM50347945
NameBDBM50347945
Synonyms:CHEMBL1800774
TypeSmall organic molecule
Emp. Form.C22H22F3N5O
Mol. Mass.429.4382
SMILESCC(C)(N)C(=O)N1CCn2c(C1)nc(c2Nc1ccc(F)c(F)c1)-c1ccc(F)cc1