Reaction Details
TargetMelanocortin receptor 4
LigandBDBM50348585
Substrate/Competitorn/a
Meas. Tech.ChEMBL_755005 (CHEMBL1805907)
IC50 2.1±n/a nM
Citation He, SYe, ZDobbelaar, PHSebhat, IKGuo, LLiu, JJian, TLai, YFranklin, CLBakshi, RKDellureficio, JPHong, QWeinberg, DHMacneil, TTang, RStrack, AMTamvakopoulos, CPeng, QMiller, RRStearns, RAChen, HYChen, ASFong, TMWyvratt, MJNargund, RP Spiroindane based amides as potent and selective MC4R agonists for the treatment of obesity. Bioorg Med Chem Lett20:4399-405 (2010) 
 
Melanocortin receptor 4
Name:Melanocortin receptor 4
Type:Enzyme
Mol. Mass.:36949.50
Organism:Homo sapiens (Human)
Description:P32245
Residue:332
BDBM50348585
NameBDBM50348585
Synonyms:CHEMBL1801142
TypeSmall organic molecule
Emp. Form.C36H48ClF2N3O2
Mol. Mass.628.235
SMILESCCN(C)C(=O)C(C)(C)[C@H]1CC2(CCN(CC2)C(=O)[C@@H]2CN(C[C@H]2c2ccc(F)cc2F)C(C)(C)C)c2cc(Cl)c(C)cc12