Reaction Details
TargetCytochrome P450 2C9
LigandBDBM50348709
Substrate/Competitorn/a
Meas. Tech.ChEMBL_755038 (CHEMBL1805940)
EC50 22000±n/a nM
Citation Payne, JEBonnefous, CSymons, KTNguyen, PMSablad, MRozenkrants, NZhang, YWang, LYazdani, NShiau, AKNoble, SARix, PRao, TSHassig, CASmith, ND Discovery of dual inducible/neuronal nitric oxide synthase (iNOS/nNOS) inhibitor development candidate 4-((2-cyclobutyl-1H-imidazo[4,5-b]pyrazin-1-yl)methyl)-7,8-difluoroquinolin-2(1H)-one (KD7332) part 2: identification of a novel, potent, and selective series of benzimidazole-quinolinone iNOS/nNO J Med Chem53:7739-55 (2010) 
 
Cytochrome P450 2C9
Name:Cytochrome P450 2C9
Type:Enzyme
Mol. Mass.:55636.33
Organism:Homo sapiens (Human)
Description:P11712
Residue:490
BDBM50348709
NameBDBM50348709
Synonyms:CHEMBL1801062
TypeSmall organic molecule
Emp. Form.C19H14F3N5O
Mol. Mass.385.3426
SMILESFc1cccc2c(Cn3c(nc4nccnc34)C3CC(F)(F)C3)cc(=O)[nH]c12